Target
M-phase inducer phosphatase 1
Ligand
BDBM50080994
Substrate
Meas. Tech.
ChEBML_49006
IC50
30000±n/a nM
Citation
 Blanchard, JLEpstein, DMBoisclair, MDRudolph, JPal, K Dysidiolide and related gamma-hydroxy butenolide compounds as inhibitors of the protein tyrosine phosphatase, CDC25. Bioorg Med Chem Lett 9:2537-8 (1999)  
Target
Name:
M-phase inducer phosphatase 1
Synonyms:
CDC25A Dual specificity phosphatase Cdc25A MPIP1_HUMAN | phosphatase Cdc25
Type:
Protein
Mol. Mass.:
59090.18
Organism:
Homo sapiens (Human)
Description:
P30304
Residue:
524
  
Inhibitor
Name:
BDBM50080994
Synonyms:
CHEMBL85943 | sodium tungstate
Type:
Small organic molecule
Emp. Form.:
O4W
Mol. Mass.:
247.84
SMILES:
[O-][W]([O-])(=O)=O
: