Target
rRNA adenine N-6-methyltransferase
Ligand
BDBM50081292
Substrate
Meas. Tech.
ChEMBL_67531 (CHEMBL679968)
Ki
10000±n/a nM
Citation
 Hajduk, PJDinges, JSchkeryantz, JMJanowick, DKaminski, MTufano, MAugeri, DJPetros, ANienaber, VZhong, PHammond, RCoen, MBeutel, BKatz, LFesik, SW Novel inhibitors of Erm methyltransferases from NMR and parallel synthesis. J Med Chem 42:3852-9 (1999)  
Target
Name:
rRNA adenine N-6-methyltransferase
Synonyms:
ERM_STREE Macrolide-lincosamide-streptogramin B resistance protein | erm
Type:
PROTEIN
Mol. Mass.:
28804.82
Organism:
Streptococcus pneumoniae
Description:
ChEMBL_67532
Residue:
245
  
Inhibitor
Name:
BDBM50081292
Synonyms:
CHEMBL338033 | N-Indan-2-yl-6-methylsulfanyl-[1,3,5]triazine-2,4-diamine
Type:
Small organic molecule
Emp. Form.:
C13H15N5S
Mol. Mass.:
273.357
SMILES:
CSc1nc(N)nc(NC2Cc3ccccc3C2)n1
: