Target
Prostaglandin E2 receptor EP1 subtype
Ligand
BDBM50081439
Substrate
Meas. Tech.
ChEBML_158177
Ki
17±n/a nM
Citation
 Ruel, RLacombe, PAbramovitz, MGodbout, CLamontagne, SRochette, CSawyer, NStocco, RTremblay, NMMetters, KMLabelle, M New class of biphenylene dibenzazocinones as potent ligands for the human EP1 prostanoid receptor. Bioorg Med Chem Lett 9:2699-704 (1999)  
Target
Name:
Prostaglandin E2 receptor EP1 subtype
Synonyms:
PE2R1_HUMAN PTGER1 Prostaglandin E2 receptor EP1 subtype Prostanoid EP1 receptor
Type:
Enzyme
Mol. Mass.:
41834.57
Organism:
Homo sapiens (Human)
Description:
P34995
Residue:
402
  
Inhibitor
Name:
BDBM50081439
Synonyms:
CHEMBL92539 | sulfonylurea analogue
Type:
Small organic molecule
Emp. Form.:
C38H35N3O4S
Mol. Mass.:
629.767
SMILES:
CN(CCc1ccccc1)C(=O)NS(=O)(=O)c1ccccc1-c1ccc(CN2c3ccccc3CCc3ccccc3C2=O)cc1
: