Target
Prostaglandin E2 receptor EP4 subtype
Ligand
BDBM50081449
Substrate
Meas. Tech.
ChEBML_158335
Ki
>100000±n/a nM
Citation
 Ruel, RLacombe, PAbramovitz, MGodbout, CLamontagne, SRochette, CSawyer, NStocco, RTremblay, NMMetters, KMLabelle, M New class of biphenylene dibenzazocinones as potent ligands for the human EP1 prostanoid receptor. Bioorg Med Chem Lett 9:2699-704 (1999)  
Target
Name:
Prostaglandin E2 receptor EP4 subtype
Synonyms:
PE2R4_HUMAN PGE2 receptor EP4 subtype PTGER4 Prostanoid EP4 receptor
Type:
Enzyme
Mol. Mass.:
53134.53
Organism:
Homo sapiens (Human)
Description:
P35408
Residue:
488
  
Inhibitor
Name:
BDBM50081449
Synonyms:
CHEMBL91301 | sulfonylurea analogue
Type:
Small organic molecule
Emp. Form.:
C44H39N3O4S
Mol. Mass.:
705.863
SMILES:
O=C(NCCc1ccccc1)N(Cc1ccccc1)S(=O)(=O)c1ccccc1-c1ccc(CN2c3ccccc3CCc3ccccc3C2=O)cc1
: