Target
Nitric oxide synthase, brain
Ligand
BDBM50526361
Substrate
Meas. Tech.
ChEMBL_1899882 (CHEMBL4401997)
Ki
13±n/a nM
Citation
 Do, HTLi, HChreifi, GPoulos, TLSilverman, RB Optimization of Blood-Brain Barrier Permeability with Potent and Selective Human Neuronal Nitric Oxide Synthase Inhibitors Having a 2-Aminopyridine Scaffold. J Med Chem 62:2690-2707 (2019)  
Target
Name:
Nitric oxide synthase, brain
Synonyms:
Bnos NC-NOS NOS type I nNOS Neuronal nitric oxide synthase Nitric Oxide Synthase, brain Nitric oxide synthase, brain (nNOS) Nitric-oxide synthase, brain (nNOS) Nos1 | Peptidyl-cysteine S-nitrosylase NOS1
Type:
Enzyme
Mol. Mass.:
160570.98
Organism:
Rattus norvegicus (rat)
Description:
Recombinant nNOS overexpressed in E. coli was used in enzyme assays.
Residue:
1429
  
Inhibitor
Name:
BDBM50526361
Synonyms:
CHEMBL4532683
Type:
Small organic molecule
Emp. Form.:
C21H27F2N3
Mol. Mass.:
359.456
SMILES:
CN1CCC[C@@H]1CCc1cc(F)c(F)c(CCc2cc(C)cc(N)n2)c1
: