Target
Neuronal acetylcholine receptor subunit alpha-4/beta-2
Ligand
BDBM50049756
Substrate
Meas. Tech.
ChEBML_142762
Ki
0.150000±n/a nM
Citation
 Lin, NHAbreo, MAGunn, DELebold, SALee, ELWasicak, JTHettinger, AMDaanen, JFGarvey, DSCampbell, JESullivan, JPWilliams, MArneric, SP Structure-activity studies on a novel series of cholinergic channel activators based on a heteroaryl ether framework. Bioorg Med Chem Lett 9:2747-52 (1999)  
Target
Name:
Neuronal acetylcholine receptor subunit alpha-4/beta-2
Synonyms:
Neuronal acetylcholine receptor alpha4/beta2 Neuronal acetylcholine receptor; alpha4/beta2
Type:
Mol. Mass.:
Description:
Components:
This complex has 0 components.
Component 1
Name:
Neuronal acetylcholine receptor subunit alpha-4
Synonyms:
ACHA4_RAT Cholinergic, Nicotinic Alpha4Beta2 Chrna4 Neuronal acetylcholine receptor (alpha4beta2 nAChR) Neuronal acetylcholine receptor subunit alpha 4 beta 2 | Neuronal acetylcholine receptor subunit alpha-4
Type:
Enzyme
Mol. Mass.:
70196.44
Organism:
Rattus norvegicus (Rat)
Description:
P09483
Residue:
630
  
Component 2
Name:
Neuronal acetylcholine receptor subunit beta-2
Synonyms:
ACHB2_RAT Chrnb2 Neuronal acetylcholine receptor non-alpha-1 chain
Type:
Enzyme
Mol. Mass.:
56910.32
Organism:
Rattus norvegicus (Rat)
Description:
P12390
Residue:
500
  
Inhibitor
Name:
BDBM50049756
Synonyms:
3-((S)-1-Methyl-pyrrolidin-2-ylmethoxy)-pyridine CHEMBL84149
Type:
Small organic molecule
Emp. Form.:
C11H16N2O
Mol. Mass.:
192.2575
SMILES:
CN1CCC[C@H]1COc1cccnc1
: