Target
Neuronal acetylcholine receptor subunit alpha-10
Ligand
BDBM50081496
Substrate
Meas. Tech.
ChEBML_142761
Ki
>10000±n/a nM
Citation
 Lin, NHAbreo, MAGunn, DELebold, SALee, ELWasicak, JTHettinger, AMDaanen, JFGarvey, DSCampbell, JESullivan, JPWilliams, MArneric, SP Structure-activity studies on a novel series of cholinergic channel activators based on a heteroaryl ether framework. Bioorg Med Chem Lett 9:2747-52 (1999)  
Target
Name:
Neuronal acetylcholine receptor subunit alpha-10
Synonyms:
ACH10_RAT Neuronal acetylcholine receptor protein alpha-10 subunit | Nicotinic acetylcholine receptor alpha9/alpha10
Type:
PROTEIN
Mol. Mass.:
49830.54
Organism:
Rattus norvegicus
Description:
ChEMBL_143222
Residue:
447
  
Inhibitor
Name:
BDBM50081496
Synonyms:
5-((S)-1-Azetidin-2-ylmethoxy)-pyrimidine | CHEMBL328705
Type:
Small organic molecule
Emp. Form.:
C8H11N3O
Mol. Mass.:
165.1924
SMILES:
C(Oc1cncnc1)[C@@H]1CCN1
: