Target
Reverse transcriptase/RNaseH
Ligand
BDBM50081626
Substrate
Meas. Tech.
ChEMBL_195667 (CHEMBL800662)
IC50
410±n/a nM
Citation
 Genin, MJPoel, TJMay, PDKopta, LAYagi, YOlmsted, RAFriis, JMVoorman, RLAdams, WJThomas, RCRomero, DL Synthesis and structure-activity relationships of the (alkylamino)piperidine-containing BHAP class of non-nucleoside reverse transcriptase inhibitors: effect of 3-alkylpyridine ring substitution. J Med Chem 42:4140-9 (1999)  
Target
Name:
Reverse transcriptase/RNaseH
Synonyms:
HIV-1 Reverse Transcriptase RNase H Reverse transcriptase/RNaseH
Type:
PROTEIN
Mol. Mass.:
65229.15
Organism:
Human immunodeficiency virus 1
Description:
ChEMBL_1473730
Residue:
566
  
Inhibitor
Name:
BDBM50081626
Synonyms:
CHEMBL336318 | N-(2-{4-[Ethyl-(3-isobutyl-pyridin-2-yl)-amino]-piperidine-1-carbonyl}-1H-indol-5-yl)-methanesulfonamide
Type:
Small organic molecule
Emp. Form.:
C26H35N5O3S
Mol. Mass.:
497.653
SMILES:
CCN(C1CCN(CC1)C(=O)c1cc2cc(NS(C)(=O)=O)ccc2[nH]1)c1ncccc1CC(C)C
: