Target
Non-receptor tyrosine-protein kinase TYK2
Ligand
BDBM50526610
Substrate
Meas. Tech.
ChEMBL_1900329 (CHEMBL4402444)
Ki
0.200000±n/a nM
Target
Name:
Non-receptor tyrosine-protein kinase TYK2
Synonyms:
Non-receptor tyrosine-protein kinase TYK2 (TYK2) TYK2_HUMAN | Tyrosine-protein kinase TYK2
Type:
Protein
Mol. Mass.:
133666.03
Organism:
Homo sapiens (Human)
Description:
P29597
Residue:
1187
  
Inhibitor
Name:
BDBM50526610
Synonyms:
CHEMBL4453441
Type:
Small organic molecule
Emp. Form.:
C23H20N8O2
Mol. Mass.:
440.4573
SMILES:
CNc1cc(Nc2cccn(-c3ccc(cc3)C#N)c2=O)nn2c(cnc12)C(=O)NC1CC1
: