Target
5-hydroxytryptamine receptor 3A/3B
Ligand
BDBM50060688
Substrate
Meas. Tech.
ChEMBL_140911 (CHEMBL747899)
EC50
3±n/a nM
Citation
 Campiani, GMorelli, EGemma, SNacci, VButini, SHamon, MNovellino, EGreco, GCagnotto, AGoegan, MCervo, LDalla Valle, FFracasso, CCaccia, SMennini, T Pyrroloquinoxaline derivatives as high-affinity and selective 5-HT(3) receptor agonists: synthesis, further structure-activity relationships, and biological studies. J Med Chem 42:4362-79 (1999)  
Target
Name:
5-hydroxytryptamine receptor 3A/3B
Synonyms:
Serotonin 3 (5-HT3) receptor Serotonin 3a (5-HT3a)/3b (5-HT3b) receptor
Type:
Mol. Mass.:
Description:
ASSAY_ID of EBI is 3097
Components:
This complex has 2 components.
Component 1
Name:
5-hydroxytryptamine receptor 3A
Synonyms:
5-HT-3 5-HT3A 5-hydroxytryptamine receptor 3 (5-HT3) 5-hydroxytryptamine receptor 3A (5HT3A) 5HT3R HTR3A Serotonin 3 receptor (5HT3) Serotonin-gated ion channel receptor | Serotonin-gated ion channel receptor 3
Type:
Protein
Mol. Mass.:
55283.27
Organism:
Homo sapiens (Human)
Description:
P46098
Residue:
478
  
Component 2
Name:
5-hydroxytryptamine receptor 3B
Synonyms:
5-HT-3B 5-hydroxytryptamine receptor 3B HTR3B Serotonin receptor 3B
Type:
PROTEIN
Mol. Mass.:
50281.60
Organism:
Homo sapiens (Human)
Description:
EBI_11305
Residue:
441
  
Inhibitor
Name:
BDBM50060688
Synonyms:
7-Fluoro-4-(4-methyl-piperazin-1-yl)-pyrrolo[1,2-a]quinoxaline CHEMBL341474
Type:
Small organic molecule
Emp. Form.:
C16H17FN4
Mol. Mass.:
284.3314
SMILES:
CN1CCN(CC1)c1nc2cc(F)ccc2n2cccc12
: