Target
Glutamate receptor ionotropic, NMDA 1
Ligand
BDBM50082016
Substrate
Meas. Tech.
ChEMBL_140543 (CHEMBL748771)
Ki
42±n/a nM
Citation
 Kreimeyer, ALaube, BSturgess, MGoeldner, MFoucaud, B Evaluation and biological properties of reactive ligands for the mapping of the glycine site on the N-methyl-D-aspartate (NMDA) receptor. J Med Chem 42:4394-404 (1999)  
Target
Name:
Glutamate receptor ionotropic, NMDA 1
Synonyms:
Glutamate (NMDA) receptor subunit zeta 1 Glutamate-NMDA-Channel Glutamate-NMDA-Polyamine NMDA Nmdar1 | phencyclidine
Type:
Enzyme Catalytic Domain
Mol. Mass.:
105533.40
Organism:
RAT
Description:
P35439
Residue:
938
  
Inhibitor
Name:
BDBM50082016
Synonyms:
2-Chloro-N-[3-(7-chloro-4-hydroxy-2-oxo-1,2-dihydro-quinolin-3-yl)-phenyl]-acetamide | CHEMBL138159
Type:
Small organic molecule
Emp. Form.:
C17H12Cl2N2O3
Mol. Mass.:
363.195
SMILES:
Oc1c(-c2cccc(NC(=O)CCl)c2)c(=O)[nH]c2cc(Cl)ccc12
: