Target
Gamma-aminobutyric acid receptor subunit alpha-2
Ligand
BDBM50418481
Substrate
Meas. Tech.
ChEMBL_1901495 (CHEMBL4403717)
Ki
0.300000±n/a nM
Citation
 Maramai, SBenchekroun, MWard, SEAtack, JR Subtype Selective ?-Aminobutyric Acid Type A Receptor (GABA J Med Chem 63:3425-3446 (2020)  
Target
Name:
Gamma-aminobutyric acid receptor subunit alpha-2
Synonyms:
GABA receptor alpha-2 subunit GBRA2_HUMAN | Gamma-aminobutyric acid receptor subunit alpha-2 (GABRA2)
Type:
Protein
Mol. Mass.:
51338.78
Organism:
Homo sapiens (Human)
Description:
P47869
Residue:
451
  
Inhibitor
Name:
BDBM50418481
Synonyms:
CHEMBL1783282
Type:
Small organic molecule
Emp. Form.:
C19H19FN4O2
Mol. Mass.:
354.3782
SMILES:
CCCNC(=O)c1nnc2c(cccc2c1N)-c1c(F)cccc1OC
: