Target
Anionic trypsin
Ligand
BDBM50060043
Substrate
Meas. Tech.
ChEBML_212167
Ki
220±n/a nM
Citation
 Stürzebecher, JVieweg, HSteinmetzer, TSchweinitz, AStubbs, MTRenatus, MWikström, P 3-Amidinophenylalanine-based inhibitors of urokinase. Bioorg Med Chem Lett 9:3147-52 (1999)  
Target
Name:
Anionic trypsin
Synonyms:
Anionic trypsin Trypsin II
Type:
PROTEIN
Mol. Mass.:
26281.39
Organism:
Bos taurus
Description:
ChEMBL_212177
Residue:
247
  
Inhibitor
Name:
BDBM50060043
Synonyms:
3-[2-(Naphthalene-2-sulfonylamino)-3-oxo-3-piperazin-1-yl-propyl]-benzamidine | CHEMBL319868
Type:
Small organic molecule
Emp. Form.:
C24H27N5O3S
Mol. Mass.:
465.568
SMILES:
NC(=N)c1cccc(CC(NS(=O)(=O)c2ccc3ccccc3c2)C(=O)N2CCNCC2)c1
: