Target
Carbonic anhydrase 2
Ligand
BDBM50527086
Substrate
Meas. Tech.
ChEMBL_1902056 (CHEMBL4404278)
Ki
0.610000±n/a nM
Citation
 Fares, MEldehna, WMBua, SLanzi, CLucarini, LMasini, EPeat, TSAbdel-Aziz, HANocentini, AKeller, PASupuran, CT Discovery of Potent Dual-Tailed Benzenesulfonamide Inhibitors of Human Carbonic Anhydrases Implicated in Glaucoma and in Vivo Profiling of Their Intraocular Pressure-Lowering Action. J Med Chem 63:3317-3326 (2020)  
Target
Name:
Carbonic anhydrase 2
Synonyms:
CA-II CAC Carbonate dehydratase II Carbonic anhydrase 2 (CA-II) Carbonic anhydrase C Carbonic anhydrase II (CA-II) Carbonic anhydrase II (hCA II) | Carbonic anhydrase isoenzyme II (hCA II)
Type:
Enzyme
Mol. Mass.:
29250.71
Organism:
Homo sapiens (Human)
Description:
P00918
Residue:
260
  
Inhibitor
Name:
BDBM50527086
Synonyms:
CHEMBL4458973
Type:
Small organic molecule
Emp. Form.:
C17H15ClN2O4S
Mol. Mass.:
378.83
SMILES:
CC(=O)C(=C/c1ccc(Cl)cc1)\C(=O)Nc1ccc(cc1)S(N)(=O)=O
: