Target
Muscarinic acetylcholine receptor M3
Ligand
BDBM50082336
Substrate
Meas. Tech.
ChEBML_138246
IC50
1300±n/a nM
Citation
 Novelli, FSparatore, ATasso, BSparatore, F Quinolizidinyl derivatives of 5,11-dihydro-6H-pyrido[2,3-b][1,4]benzodiazepin-6-one as ligands for muscarinic receptors. Bioorg Med Chem Lett 9:3031-4 (1999)  
Target
Name:
Muscarinic acetylcholine receptor M3
Synonyms:
ACM3_RAT Chrm-3 | Chrm3
Type:
Enzyme Catalytic Domain
Mol. Mass.:
66086.66
Organism:
RAT
Description:
Cholinergic, muscarinic M3 CHRM3 RAT::P08483
Residue:
589
  
Inhibitor
Name:
BDBM50082336
Synonyms:
CHEMBL322378 | N-(4-Benzoyl-2-methyl-phenyl)-2-(R)-octahydro-quinolizin-1-yl-acetamide
Type:
Small organic molecule
Emp. Form.:
C25H30N2O2
Mol. Mass.:
390.5179
SMILES:
Cc1cc(ccc1NC(=O)CC1CCCN2CCCC[C@H]12)C(=O)c1ccccc1
: