Target
4-aminobutyrate aminotransferase, mitochondrial
Ligand
BDBM50082744
Substrate
Meas. Tech.
ChEMBL_70658 (CHEMBL678648)
Ki
600000±n/a nM
Citation
 Qiu, JPingsterhaus, JMSilverman, RB Inhibition and substrate activity of conformationally rigid vigabatrin analogues with gamma-aminobutyric acid aminotransferase. J Med Chem 42:4725-8 (1999)  
Target
Name:
4-aminobutyrate aminotransferase, mitochondrial
Synonyms:
(S)-3-amino-2-methylpropionate transaminase 2.6.1.22 ABAT GABA transaminase GABA-T GABT_PIG L-AIBAT
Type:
Mol. Mass.:
56633.06
Organism:
Sus scrofa
Description:
Residue:
500
  
Inhibitor
Name:
BDBM50082744
Synonyms:
4-Amino-cyclopent-2-enecarboxylic acid | CHEMBL358450
Type:
Small organic molecule
Emp. Form.:
C6H9NO2
Mol. Mass.:
127.1412
SMILES:
NC1CC(C=C1)C(O)=O
: