Target
Activin receptor type-1
Ligand
BDBM50528203
Substrate
Meas. Tech.
ChEMBL_1904565 (CHEMBL4406787)
IC50
4.0±n/a nM
Citation
 Ensan, DSmil, DZepeda-Velázquez, CAPanagopoulos, DWong, JFWilliams, EPAdamson, RBullock, ANKiyota, TAman, ARoberts, OGEdwards, AMO'Meara, JAIsaac, MBAl-Awar, R Targeting ALK2: An Open Science Approach to Developing Therapeutics for the Treatment of Diffuse Intrinsic Pontine Glioma. J Med Chem 63:4978-4996 (2020)  
Target
Name:
Activin receptor type-1
Synonyms:
2.7.11.30 ACVR1 ACVRLK2 ALK2/ACVR1 Activin receptor-like kinase 2 Activin receptor-like kinase 2 (ALK2/ACVR1) SKR1 TGF-B superfamily receptor type I | TSR-I
Type:
Mol. Mass.:
57158.32
Organism:
Homo sapiens (Human)
Description:
Residue:
509
  
Inhibitor
Name:
BDBM50528203
Synonyms:
CHEMBL4434694
Type:
Small organic molecule
Emp. Form.:
C24H25ClN4O2
Mol. Mass.:
436.934
SMILES:
COc1cc(cc(Cl)c1C(N)=O)-c1cncc(c1C)-c1ccc(cc1)N1CCNCC1
: