Target
Disintegrin and metalloproteinase domain-containing protein 17
Ligand
BDBM50082946
Substrate
Meas. Tech.
ChEMBL_212750 (CHEMBL820592)
IC50
0.33±n/a nM
Citation
 Barlaam, BBird, TGLambert-Van Der Brempt, CCampbell, DFoster, SJMaciewicz, R New alpha-substituted succinate-based hydroxamic acids as TNFalpha convertase inhibitors. J Med Chem 42:4890-908 (1999)  
Target
Name:
Disintegrin and metalloproteinase domain-containing protein 17
Synonyms:
ADA17_HUMAN CSVP Disintegrin and metalloproteinase domain-containing protein 17 (ADAM17) TNF-alpha convertase TNF-alpha-converting enzyme (TACE) Tumor necrosis factor-α converting enzyme (TACE)
Type:
Enzyme
Mol. Mass.:
93007.89
Organism:
Homo sapiens (Human)
Description:
Residue:
824
  
Inhibitor
Name:
BDBM50082946
Synonyms:
(2R,3S)-2-(7-Bromo-2-methyl-4-oxo-3,4-dihydro-quinazolin-6-ylmethoxy)-N*4*-((S)-2,2-dimethyl-1-methylcarbamoyl-propyl)-N*1*-hydroxy-3-isobutyl-succinamide | CHEMBL357203
Type:
Small organic molecule
Emp. Form.:
C25H36BrN5O6
Mol. Mass.:
582.487
SMILES:
CNC(=O)[C@@H](NC(=O)[C@H](CC(C)C)[C@H](OCc1cc2c(cc1Br)nc(C)[nH]c2=O)C(=O)NO)C(C)(C)C
: