Target
5-hydroxytryptamine receptor 1D
Ligand
BDBM50083122
Substrate
Meas. Tech.
ChEMBL_1700 (CHEMBL616907)
IC50
18±n/a nM
Citation
 Russell, MGMatassa, VGPengilley, RRvan Niel, MBSohal, BWatt, APHitzel, LBeer, MSStanton, JABroughton, HBCastro, JL 3-[3-(Piperidin-1-yl)propyl]indoles as highly selective h5-HT(1D) receptor agonists. J Med Chem 42:4981-5001 (2000)  
Target
Name:
5-hydroxytryptamine receptor 1D
Synonyms:
5-HT-1D 5-HT1D 5HT1D_HUMAN HTR1DA Serotonin (5-HT) receptor | Serotonin Receptor 1D
Type:
G Protein-Coupled Receptor (GPCR)
Mol. Mass.:
41920.63
Organism:
Homo sapiens (Human)
Description:
Receptor binding assays were performed using human clone stably expressed in CHO cells.
Residue:
377
  
Inhibitor
Name:
BDBM50083122
Synonyms:
1-Methyl-3-phenyl-1-{1-[3-(5-[1,2,4]triazol-4-yl-1H-indol-3-yl)-propyl]-piperidin-4-yl}-urea | CHEMBL148325
Type:
Small organic molecule
Emp. Form.:
C26H31N7O
Mol. Mass.:
457.5706
SMILES:
CN(C1CCN(CCCc2c[nH]c3ccc(cc23)-n2cnnc2)CC1)C(=O)Nc1ccccc1
: