Target
5-hydroxytryptamine receptor 1B
Ligand
BDBM50060429
Substrate
Meas. Tech.
ChEMBL_1614 (CHEMBL616639)
IC50
150±n/a nM
Citation
 Russell, MGMatassa, VGPengilley, RRvan Niel, MBSohal, BWatt, APHitzel, LBeer, MSStanton, JABroughton, HBCastro, JL 3-[3-(Piperidin-1-yl)propyl]indoles as highly selective h5-HT(1D) receptor agonists. J Med Chem 42:4981-5001 (2000)  
Target
Name:
5-hydroxytryptamine receptor 1B
Synonyms:
5-HT-1B 5-HT1B 5HT1B_HUMAN HTR1DB Serotonin (5-HT) receptor Serotonin Receptor 1B
Type:
G Protein-Coupled Receptor (GPCR)
Mol. Mass.:
43579.17
Organism:
Homo sapiens (Human)
Description:
Receptor binding assays were performed using human clone stably expressed in CHO cells
Residue:
390
  
Inhibitor
Name:
BDBM50060429
Synonyms:
(R)-2-(4-Fluoro-phenyl)-2-{1-[3-(5-[1,2,4]triazol-4-yl-1H-indol-3-yl)-propyl]-piperidin-4-ylamino}-ethanol | CHEMBL313714
Type:
Small organic molecule
Emp. Form.:
C26H31FN6O
Mol. Mass.:
462.5623
SMILES:
OC[C@H](NC1CCN(CCCc2c[nH]c3ccc(cc23)-n2cnnc2)CC1)c1ccc(F)cc1
: