Target
Biotin carboxylase
Ligand
BDBM3429
Substrate
Meas. Tech.
ChEMBL_1905195 (CHEMBL4407553)
IC50
320±n/a nM
Citation
 Andrews, LDKane, TRDozzo, PHaglund, CMHilderbrandt, DJLinsell, MSMachajewski, TMcEnroe, GSerio, AWWlasichuk, KBNeau, DBPakhomova, SWaldrop, GLSharp, MPogliano, JCirz, RTCohen, F Optimization and Mechanistic Characterization of Pyridopyrimidine Inhibitors of Bacterial Biotin Carboxylase. J Med Chem 62:7489-7505 (2019)  
Target
Name:
Biotin carboxylase
Synonyms:
6.3.4.14 ACC Acetyl-CoA carboxylase subunit A accC fabG
Type:
PROTEIN
Mol. Mass.:
48885.33
Organism:
Pseudomonas aeruginosa (strain ATCC 15692 / DSM 22644 / CIP 104116 / JCM14847 / LMG 12228 / 1C / PRS 101 / PAO1)
Description:
ChEMBL_118971
Residue:
449
  
Inhibitor
Name:
BDBM3429
Synonyms:
6-(2,6-dichlorophenyl)pyrido[2,3-d]pyrimidine-2,7-diamine | 6-arylpyrido[2,3-d]pyrimidine deriv. 11
Type:
Small organic molecule
Emp. Form.:
C13H9Cl2N5
Mol. Mass.:
306.15
SMILES:
Nc1ncc2cc(c(N)nc2n1)-c1c(Cl)cccc1Cl
: