Target
Peroxisome proliferator-activated receptor gamma
Ligand
BDBM50217318
Substrate
Meas. Tech.
ChEMBL_154518 (CHEMBL764404)
EC50
<10000±n/a nM
Citation
 Henke, BRAdkison, KKBlanchard, SGLeesnitzer, LMMook, RAPlunket, KDRay, JARoberson, CUnwalla, RWillson, TM Synthesis and biological activity of a novel series of indole-derived PPARgamma agonists. Bioorg Med Chem Lett 9:3329-34 (2000)  
Target
Name:
Peroxisome proliferator-activated receptor gamma
Synonyms:
NR1C3 PPAR-gamma PPARG_HUMAN Peroxisome proliferator-activated receptor gamma (PPAR gamma) Peroxisome proliferator-activated receptor gamma (PPARĪ³) peroxisome proliferator-activated receptor gamma isoform 2
Type:
Nuclear Receptor
Mol. Mass.:
57613.46
Organism:
Homo sapiens (Human)
Description:
P37231
Residue:
505
  
Inhibitor
Name:
BDBM50217318
Synonyms:
CHEMBL113006
Type:
Small organic molecule
Emp. Form.:
C23H19NO2
Mol. Mass.:
341.4025
SMILES:
OC(=O)Cc1ccc2[nH]c(c(Cc3ccccc3)c2c1)-c1ccccc1
: