Target
Peroxisome proliferator-activated receptor gamma
Ligand
BDBM50217321
Substrate
Meas. Tech.
ChEMBL_154522 (CHEMBL762149)
Ki
550±n/a nM
Citation
 Henke, BRAdkison, KKBlanchard, SGLeesnitzer, LMMook, RAPlunket, KDRay, JARoberson, CUnwalla, RWillson, TM Synthesis and biological activity of a novel series of indole-derived PPARgamma agonists. Bioorg Med Chem Lett 9:3329-34 (2000)  
Target
Name:
Peroxisome proliferator-activated receptor gamma
Synonyms:
NR1C3 PPAR-gamma PPARG_HUMAN Peroxisome proliferator-activated receptor gamma (PPAR gamma) Peroxisome proliferator-activated receptor gamma (PPARĪ³) peroxisome proliferator-activated receptor gamma isoform 2
Type:
Nuclear Receptor
Mol. Mass.:
57613.46
Organism:
Homo sapiens (Human)
Description:
P37231
Residue:
505
  
Inhibitor
Name:
BDBM50217321
Synonyms:
CHEMBL111841
Type:
Small organic molecule
Emp. Form.:
C25H23NO2
Mol. Mass.:
369.4556
SMILES:
Cn1c(c(CCc2ccccc2)c2cc(CC(O)=O)ccc12)-c1ccccc1
: