Target
Epidermal growth factor receptor
Ligand
BDBM50083644
Substrate
Meas. Tech.
ChEBML_67068
IC50
1704±n/a nM
Citation
 Moffat, DDavis, PHutchings, MDavis, JBerg, DBatchelor, MJohnson, JO'Connell, JMartin, RCrabbe, TDelgado, JPerry, M 4-Pyridin-5-yl-2-(3,4,5-trimethoxyphenylamino)pyrimidines: potent and selective inhibitors of ZAP 70. Bioorg Med Chem Lett 9:3351-6 (2000)  
Target
Name:
Epidermal growth factor receptor
Synonyms:
EGF Receptor Substrate EGFR_HUMAN ERBB1 Epidermal Growth Factor Receptor erbB-1 Epidermal growth factor receptor (EGFR) HER1 Proto-oncogene c-ErbB-1 Tyrosine-Protein Kinase ErbB-1
Type:
Receptor Kinase Domain
Mol. Mass.:
134279.59
Organism:
Homo sapiens (Human)
Description:
P00533
Residue:
1210
  
Inhibitor
Name:
BDBM50083644
Synonyms:
CHEMBL322066 | [4-(6-Piperazin-1-yl-pyridin-3-yl)-pyrimidin-2-yl]-(3,4,5-trimethoxy-phenyl)-amine
Type:
Small organic molecule
Emp. Form.:
C22H26N6O3
Mol. Mass.:
422.4802
SMILES:
COc1cc(Nc2nccc(n2)-c2ccc(nc2)N2CCNCC2)cc(OC)c1OC
: