Target
Tyrosine-protein kinase ZAP-70
Ligand
BDBM50083646
Substrate
Meas. Tech.
ChEBML_217766
IC50
396±n/a nM
Citation
 Moffat, DDavis, PHutchings, MDavis, JBerg, DBatchelor, MJohnson, JO'Connell, JMartin, RCrabbe, TDelgado, JPerry, M 4-Pyridin-5-yl-2-(3,4,5-trimethoxyphenylamino)pyrimidines: potent and selective inhibitors of ZAP 70. Bioorg Med Chem Lett 9:3351-6 (2000)  
Target
Name:
Tyrosine-protein kinase ZAP-70
Synonyms:
70 kDa zeta-associated protein Syk-related tyrosine kinase Tyrosine-protein kinase ZAP-70 Tyrosine-protein kinase ZAP-70 (ZAP70) ZAP70 Zeta-chain (TCR) associated protein kinase 70kDa
Type:
Enzyme
Mol. Mass.:
69881.61
Organism:
Homo sapiens (Human)
Description:
ZAP-70 SH2 domain was expressed and purified from E. coli using O-phospho-L-tyrosine-agarose column.
Residue:
619
  
Inhibitor
Name:
BDBM50083646
Synonyms:
CHEMBL323755 | {4-[6-((R)-3-Methyl-piperazin-1-yl)-pyridin-3-yl]-pyrimidin-2-yl}-(3,4,5-trimethoxy-phenyl)-amine
Type:
Small organic molecule
Emp. Form.:
C23H28N6O3
Mol. Mass.:
436.5068
SMILES:
COc1cc(Nc2nccc(n2)-c2ccc(nc2)N2CCN[C@H](C)C2)cc(OC)c1OC
: