Target
Tyrosine-protein kinase Lck
Ligand
BDBM50083643
Substrate
Meas. Tech.
ChEBML_221647
IC50
1100±n/a nM
Citation
 Moffat, DDavis, PHutchings, MDavis, JBerg, DBatchelor, MJohnson, JO'Connell, JMartin, RCrabbe, TDelgado, JPerry, M 4-Pyridin-5-yl-2-(3,4,5-trimethoxyphenylamino)pyrimidines: potent and selective inhibitors of ZAP 70. Bioorg Med Chem Lett 9:3351-6 (2000)  
Target
Name:
Tyrosine-protein kinase Lck
Synonyms:
2.7.10.2 LCK_HUMAN Leukocyte C-terminal Src kinase Lymphocyte-specific protein tyrosine kinase Protein YT16 Proto-oncogene tyrosine-protein kinase LCK T cell-specific protein-tyrosine kinase
Type:
Mol. Mass.:
57987.83
Organism:
Homo sapiens (Human)
Description:
P06239
Residue:
509
  
Inhibitor
Name:
BDBM50083643
Synonyms:
(4-Pyridin-3-yl-pyrimidin-2-yl)-(3,4,5-trimethoxy-phenyl)-amine | CHEMBL112263
Type:
Small organic molecule
Emp. Form.:
C18H18N4O3
Mol. Mass.:
338.3605
SMILES:
COc1cc(Nc2nccc(n2)-c2cccnc2)cc(OC)c1OC
: