Target
Muscarinic acetylcholine receptor M1
Ligand
BDBM50083652
Substrate
Meas. Tech.
ChEMBL_138478 (CHEMBL747467)
Ki
0.012882±n/a nM
Citation
 Krishnan, VPham, WNMesser, WSPeseckis, SM First fatty acylated dipeptides to affect muscarinic receptor ligand binding. Bioorg Med Chem Lett 9:3363-8 (2000)  
Target
Name:
Muscarinic acetylcholine receptor M1
Synonyms:
ACM1_HUMAN Cholinergic receptor, muscarinic 1 | Cholinergic, muscarinic M1
Type:
Protein
Mol. Mass.:
51442.54
Organism:
Homo sapiens (Human)
Description:
P11229
Residue:
460
  
Inhibitor
Name:
BDBM50083652
Synonyms:
CHEMBL112297 | Hexadecanoic acid (S)-2-benzyloxycarbonyl-2-(2-tetradecanoylamino-acetylamino)-ethyl ester
Type:
Small organic molecule
Emp. Form.:
C42H72N2O6
Mol. Mass.:
701.0309
SMILES:
CCCCCCCCCCCCCCCC(=O)OC[C@H](NC(=O)CNC(=O)CCCCCCCCCCCCC)C(=O)OCc1ccccc1
: