Target
5-hydroxytryptamine receptor 1D
Ligand
BDBM50083660
Substrate
Meas. Tech.
ChEBML_1694
IC50
1.2±n/a nM
Citation
 Bourrain, SNeduvelil, JGBeer, MSStanton, JAShowell, GAMacLeod, AM 4-Hydroxy-1-[3-(5-(1,2,4-triazol-4-yl)-1H-indol-3-yl)propyl]piperidines: selective h5-HT1D agonists for the treatment of migraine. Bioorg Med Chem Lett 9:3369-74 (2000)  
Target
Name:
5-hydroxytryptamine receptor 1D
Synonyms:
5-HT-1D 5-HT1D 5HT1D_HUMAN HTR1DA Serotonin (5-HT) receptor | Serotonin Receptor 1D
Type:
G Protein-Coupled Receptor (GPCR)
Mol. Mass.:
41920.63
Organism:
Homo sapiens (Human)
Description:
Receptor binding assays were performed using human clone stably expressed in CHO cells.
Residue:
377
  
Inhibitor
Name:
BDBM50083660
Synonyms:
4-[(Benzyl-methyl-amino)-methyl]-1-[3-(5-[1,2,4]triazol-4-yl-1H-indol-3-yl)-propyl]-piperidin-4-ol | CHEMBL114877
Type:
Small organic molecule
Emp. Form.:
C27H34N6O
Mol. Mass.:
458.5985
SMILES:
CN(Cc1ccccc1)CC1(O)CCN(CCCc2c[nH]c3ccc(cc23)-n2cnnc2)CC1
: