Target
Cannabinoid receptor 1
Ligand
BDBM50083845
Substrate
Meas. Tech.
ChEMBL_46821 (CHEMBL657225)
Kd
11±n/a nM
Citation
 Keimowitz, ARMartin, BRRazdan, RKCrocker, PJMascarella, SWThomas, BF QSAR analysis of Delta(8)-THC analogues: relationship of side-chain conformation to cannabinoid receptor affinity and pharmacological potency. J Med Chem 43:59-70 (2000)  
Target
Name:
Cannabinoid receptor 1
Synonyms:
CANN6 CB-R CNR CNR1_HUMAN Cannabinoid receptor Cannabinoid receptor 1 (brain)
Type:
G Protein-Coupled Receptor (GPCR)
Mol. Mass.:
52868.96
Organism:
Homo sapiens (Human)
Description:
P21554
Residue:
472
  
Inhibitor
Name:
BDBM50083845
Synonyms:
6,6,9-Trimethyl-3-oct-4-enyl-6a,7,10,10a-tetrahydro-6H-benzo[c]chromen-1-ol | CHEMBL159872
Type:
Small organic molecule
Emp. Form.:
C24H34O2
Mol. Mass.:
354.5256
SMILES:
CCC\C=C\CCCc1cc(O)c2C3CC(C)=CCC3C(C)(C)Oc2c1
: