Target
Kynurenine 3-monooxygenase
Ligand
BDBM50083931
Substrate
Meas. Tech.
ChEMBL_91745 (CHEMBL700046)
IC50
580±n/a nM
Citation
 Drysdale, MJHind, SLJansen, MReinhard, JF Synthesis and SAR of 4-aryl-2-hydroxy-4-oxobut-2-enoic acids and esters and 2-amino-4-aryl-4-oxobut-2-enoic acids and esters: potent inhibitors of kynurenine-3-hydroxylase as potential neuroprotective agents. J Med Chem 43:123-7 (2000)  
Target
Name:
Kynurenine 3-monooxygenase
Synonyms:
KMO_RAT | Kmo
Type:
PROTEIN
Mol. Mass.:
54371.88
Organism:
Rattus norvegicus
Description:
ChEMBL_1487468
Residue:
478
  
Inhibitor
Name:
BDBM50083931
Synonyms:
4-(3-Fluoro-phenyl)-2-hydroxy-4-oxo-but-2-enoic acid (0.3H2O) | CHEMBL22199
Type:
Small organic molecule
Emp. Form.:
C10H7FO4
Mol. Mass.:
210.1586
SMILES:
OC(=O)C(=O)CC(=O)c1cccc(F)c1
: