Target
Kynurenine 3-monooxygenase
Ligand
BDBM50083950
Substrate
Meas. Tech.
ChEMBL_91745 (CHEMBL700046)
IC50
4000±n/a nM
Citation
 Drysdale, MJHind, SLJansen, MReinhard, JF Synthesis and SAR of 4-aryl-2-hydroxy-4-oxobut-2-enoic acids and esters and 2-amino-4-aryl-4-oxobut-2-enoic acids and esters: potent inhibitors of kynurenine-3-hydroxylase as potential neuroprotective agents. J Med Chem 43:123-7 (2000)  
Target
Name:
Kynurenine 3-monooxygenase
Synonyms:
KMO_RAT | Kmo
Type:
PROTEIN
Mol. Mass.:
54371.88
Organism:
Rattus norvegicus
Description:
ChEMBL_1487468
Residue:
478
  
Inhibitor
Name:
BDBM50083950
Synonyms:
(S)-(+)-2-Amino-4-(3-nitro-phenyl)-4-oxo-butyric acid[(S)-(+)-m-nicotinylbenzoylalanine] CHEMBL22740
Type:
Small organic molecule
Emp. Form.:
C10H10N2O5
Mol. Mass.:
238.1968
SMILES:
N[C@@H](CC(=O)c1cccc(c1)[N+]([O-])=O)C(O)=O
: