Target
Adenosine receptor A3
Ligand
BDBM50084018
Substrate
Meas. Tech.
ChEMBL_31409 (CHEMBL644552)
IC50
186±n/a nM
Citation
 Webb, TRMelman, NLvovskiy, DJi, XDJacobson, KA The utilization of a unified pharmacophore query in the discovery of new antagonists of the adenosine receptor family. Bioorg Med Chem Lett 10:31-4 (2000)  
Target
Name:
Adenosine receptor A3
Synonyms:
A3 adenosine receptor (hA3) ADORA3 | Adenosine A3 receptor (A3AR)
Type:
G Protein-Coupled Receptor (GPCR)
Mol. Mass.:
36197.32
Organism:
Homo sapiens (Human)
Description:
P0DMS8
Residue:
318
  
Inhibitor
Name:
BDBM50084018
Synonyms:
2-Phenylacetylamino-4,7-dihydro-5H-thieno[2,3-c]pyridine-3,6-dicarboxylic acid diethyl ester diethyl 2-(2-phenylacetamido)-4,5-dihydrothieno[2,3-c]pyridine-3,6(7H)-dicarboxylate
Type:
Small organic molecule
Emp. Form.:
C21H24N2O5S
Mol. Mass.:
416.491
SMILES:
CCOC(=O)N1CCc2c(C1)sc(NC(=O)Cc1ccccc1)c2C(=O)OCC
: