Target
Acetyl-CoA carboxylase 1
Ligand
BDBM50247081
Substrate
Meas. Tech.
ChEMBL_1908107 (CHEMBL4410465)
IC50
0.180000±n/a nM
Citation
 Mizojiri, RAsano, MSasaki, MSatoh, YYamamoto, YSumi, HMaezaki, H The identification and pharmacological evaluation of potent, selective and orally available ACC1 inhibitor. Bioorg Med Chem Lett 29:0 (2019)  
Target
Name:
Acetyl-CoA carboxylase 1
Synonyms:
ACACA_MOUSE Acaca Gm738
Type:
PROTEIN
Mol. Mass.:
265247.00
Organism:
Mus musculus
Description:
ChEMBL_1286300
Residue:
2345
  
Inhibitor
Name:
BDBM50247081
Synonyms:
CHEMBL4060253
Type:
Small organic molecule
Emp. Form.:
C26H25N3O4
Mol. Mass.:
443.4944
SMILES:
CC(NC(C)=O)c1ccc2nc(oc2c1)-c1ccc(Oc2cccc(OCC3CC3)c2)nc1
: