Target
Prothrombin
Ligand
BDBM50084074
Substrate
Meas. Tech.
ChEBML_208331
Ki
30±n/a nM
Citation
 Lu, TSoll, RMIllig, CRBone, RMurphy, LSpurlino, JSalemme, FRTomczuk, BE Structure-activity and crystallographic analysis of a new class of non-amide-based thrombin inhibitor. Bioorg Med Chem Lett 10:79-82 (2000)  
Target
Name:
Prothrombin
Synonyms:
Activation peptide fragment 1 Coagulation factor II Prothrombin precursor Thrombin heavy chain | Thrombin light chain
Type:
Protein
Mol. Mass.:
70029.57
Organism:
Homo sapiens (Human)
Description:
P00734
Residue:
622
  
Inhibitor
Name:
BDBM50084074
Synonyms:
2-Chloro-benzenesulfonic acid 3-(1-carbamimidoyl-piperidin-4-ylmethoxy)-5-chloro-phenyl ester | CHEMBL352522
Type:
Small organic molecule
Emp. Form.:
C19H21Cl2N3O4S
Mol. Mass.:
458.359
SMILES:
NC(=N)N1CCC(COc2cc(Cl)cc(OS(=O)(=O)c3ccccc3Cl)c2)CC1
: