Target
Carbonic anhydrase 2
Ligand
BDBM50079035
Substrate
Meas. Tech.
ChEMBL_45075 (CHEMBL657146)
Ki
9±n/a nM
Citation
 Scozzafava, ABriganti, FIlies, MASupuran, CT Carbonic anhydrase inhibitors: synthesis of membrane-impermeant low molecular weight sulfonamides possessing in vivo selectivity for the membrane-bound versus cytosolic isozymes. J Med Chem 43:292-300 (2000)  
Target
Name:
Carbonic anhydrase 2
Synonyms:
CA-II CAC Carbonate dehydratase II Carbonic anhydrase 2 (CA-II) Carbonic anhydrase C Carbonic anhydrase II (CA-II) Carbonic anhydrase II (hCA II) | Carbonic anhydrase isoenzyme II (hCA II)
Type:
Enzyme
Mol. Mass.:
29250.71
Organism:
Homo sapiens (Human)
Description:
P00918
Residue:
260
  
Inhibitor
Name:
BDBM50079035
Synonyms:
6-Amino-benzothiazole-2-sulfonic acid amide CHEMBL35118
Type:
Small organic molecule
Emp. Form.:
C7H7N3O2S2
Mol. Mass.:
229.279
SMILES:
Nc1ccc2nc(sc2c1)S(N)(=O)=O
: