Target
Carbonic anhydrase 2
Ligand
BDBM10870
Substrate
Meas. Tech.
ChEMBL_45075 (CHEMBL657146)
Ki
2±n/a nM
Citation
 Scozzafava, ABriganti, FIlies, MASupuran, CT Carbonic anhydrase inhibitors: synthesis of membrane-impermeant low molecular weight sulfonamides possessing in vivo selectivity for the membrane-bound versus cytosolic isozymes. J Med Chem 43:292-300 (2000)  
Target
Name:
Carbonic anhydrase 2
Synonyms:
CA-II CAC Carbonate dehydratase II Carbonic anhydrase 2 (CA-II) Carbonic anhydrase C Carbonic anhydrase II (CA-II) Carbonic anhydrase II (hCA II) | Carbonic anhydrase isoenzyme II (hCA II)
Type:
Enzyme
Mol. Mass.:
29250.71
Organism:
Homo sapiens (Human)
Description:
P00918
Residue:
260
  
Inhibitor
Name:
BDBM10870
Synonyms:
2-N-(4-aminobenzene)-1,3,4-thiadiazole-2,5-disulfonamide CHEMBL268439 aminobenzolamide deriv. 43 | aromatic/heteroaromatic sulfonamide 15
Type:
Small organic molecule
Emp. Form.:
C8H9N5O4S3
Mol. Mass.:
335.383
SMILES:
Nc1ccc(cc1)S(=O)(=O)Nc1nnc(s1)S(N)(=O)=O
: