Target
5-hydroxytryptamine receptor 1B
Ligand
BDBM50084951
Substrate
Meas. Tech.
ChEMBL_278 (CHEMBL881818)
IC50
10±n/a nM
Citation
 Liao, YBöttcher, HHarting, JGreiner, Hvan Amsterdam, CCremers, TSundell, SMärz, JRautenberg, WWikström, H New selective and potent 5-HT(1B/1D) antagonists: chemistry and pharmacological evaluation of N-piperazinylphenyl biphenylcarboxamides and biphenylsulfonamides. J Med Chem 43:517-25 (2000)  
Target
Name:
5-hydroxytryptamine receptor 1B
Synonyms:
5-HT-1B 5-hydroxytryptamine receptor 1B (5HT1B) 5ht1b Serotonin 1 (5-HT1) receptor Serotonin receptor 1B
Type:
Protein
Mol. Mass.:
43173.33
Organism:
Rattus norvegicus (Rat)
Description:
P28564
Residue:
386
  
Inhibitor
Name:
BDBM50084951
Synonyms:
2'-Methyl-4'-(5-methyl-[1,2,4]oxadiazol-3-yl)-biphenyl-4-carboxylic acid [4-(2-fluoro-ethoxy)-3-(4-methyl-piperazin-1-yl)-phenyl]-amide | CHEMBL151420
Type:
Small organic molecule
Emp. Form.:
C30H32FN5O3
Mol. Mass.:
529.6052
SMILES:
CN1CCN(CC1)c1cc(NC(=O)c2ccc(cc2)-c2ccc(cc2C)-c2noc(C)n2)ccc1OCCF
: