Target
Sodium-dependent serotonin transporter
Ligand
BDBM50084961
Substrate
Meas. Tech.
ChEMBL_3531 (CHEMBL884710)
IC50
4700±n/a nM
Citation
 Liao, YBöttcher, HHarting, JGreiner, Hvan Amsterdam, CCremers, TSundell, SMärz, JRautenberg, WWikström, H New selective and potent 5-HT(1B/1D) antagonists: chemistry and pharmacological evaluation of N-piperazinylphenyl biphenylcarboxamides and biphenylsulfonamides. J Med Chem 43:517-25 (2000)  
Target
Name:
Sodium-dependent serotonin transporter
Synonyms:
5-HT Transporter 5HTT SC6A4_HUMAN SLC6A4 Serotonin transporter (5HTT) Sodium-dependent serotonin transporter (SERT) | Solute carrier family 6 member 4
Type:
Multi-pass membrane protein
Mol. Mass.:
70322.51
Organism:
Homo sapiens (Human)
Description:
P31645
Residue:
630
  
Inhibitor
Name:
BDBM50084961
Synonyms:
2'-Methyl-4'-(5-methyl-[1,3,4]oxadiazol-2-yl)-biphenyl-4-carboxylic acid [4-hydroxy-3-(4-methyl-piperazin-1-yl)-phenyl]-amide | CHEMBL359447
Type:
Small organic molecule
Emp. Form.:
C28H29N5O3
Mol. Mass.:
483.5616
SMILES:
CN1CCN(CC1)c1cc(NC(=O)c2ccc(cc2)-c2ccc(cc2C)-c2nnc(C)o2)ccc1O
: