Target
Brain-derived neurotrophic factor
Ligand
BDBM50529727
Substrate
Meas. Tech.
ChEMBL_1909741 (CHEMBL4412187)
Kd
659±n/a nM
Citation
 Yao, WChen, MDou, XJin, HZhang, XZhu, YSha, MLiu, ZMeng, XZhang, LZhu, SLi, Z Unravel a neuroactive sHA sulfation pattern with neurogenesis activity by a library of defined oligosaccharides. Eur J Med Chem 163:583-596 (2019)  
Target
Name:
Brain-derived neurotrophic factor
Synonyms:
Abrineurin BDNF_HUMAN
Type:
PROTEIN
Mol. Mass.:
27826.73
Organism:
Homo sapiens
Description:
ChEMBL_118955
Residue:
247
  
Inhibitor
Name:
BDBM50529727
Synonyms:
CHEMBL4552855
Type:
Small organic molecule
Emp. Form.:
C34H55N5O35S4
Mol. Mass.:
1222.073
SMILES:
[H][C@@]1(O[C@@H]2O[C@H](C(O)=O)[C@@]([H])(O[C@@H]3O[C@H](COS(O)(=O)=O)[C@@H](OS(O)(=O)=O)[C@]([H])(O[C@@H]4O[C@@H]([C@@H](O)[C@H](O)[C@H]4O)C(O)=O)[C@H]3NC(C)=O)[C@H](O)[C@H]2O)[C@@H](NC(C)=O)[C@H](OCCCCCCN=[N+]=[N-])O[C@H](COS(O)(=O)=O)[C@H]1OS(O)(=O)=O
: