Target
Kappa-type opioid receptor
Ligand
BDBM50451121
Substrate
Meas. Tech.
ChEBML_145849
IC50
>10000±n/a nM
Citation
 Pagé, DMcClory, AMischki, TSchmidt, RButterworth, JSt-Onge, SLabarre, MPayza, KBrown, W Novel Dmt-Tic dipeptide analogues as selective delta-opioid receptor antagonists. Bioorg Med Chem Lett 10:167-70 (2000)  
Target
Name:
Kappa-type opioid receptor
Synonyms:
K-OR-1 Kappa-opioid receptor (KOR) Kappa-type opioid receptor (KOR) OPIATE Kappa OPRK1 kappa opioid receptor (KOR)
Type:
G Protein-Coupled Receptor (GPCR)
Mol. Mass.:
42648.76
Organism:
Homo sapiens (Human)
Description:
P41145
Residue:
380
  
Inhibitor
Name:
BDBM50451121
Synonyms:
CHEMBL2115429
Type:
Small organic molecule
Emp. Form.:
C27H28N2O4
Mol. Mass.:
444.5222
SMILES:
Cc1cc(O)cc(C)c1C[C@@H](N)C(=O)N1Cc2cc(ccc2C[C@H]1C(O)=O)-c1ccccc1
: