Target
Kappa-type opioid receptor
Ligand
BDBM50084994
Substrate
Meas. Tech.
ChEBML_145849
IC50
>10000±n/a nM
Citation
 Pagé, DMcClory, AMischki, TSchmidt, RButterworth, JSt-Onge, SLabarre, MPayza, KBrown, W Novel Dmt-Tic dipeptide analogues as selective delta-opioid receptor antagonists. Bioorg Med Chem Lett 10:167-70 (2000)  
Target
Name:
Kappa-type opioid receptor
Synonyms:
K-OR-1 Kappa-opioid receptor (KOR) Kappa-type opioid receptor (KOR) OPIATE Kappa OPRK1 kappa opioid receptor (KOR)
Type:
G Protein-Coupled Receptor (GPCR)
Mol. Mass.:
42648.76
Organism:
Homo sapiens (Human)
Description:
P41145
Residue:
380
  
Inhibitor
Name:
BDBM50084994
Synonyms:
(S)-2-[2-Amino-3-(4-hydroxy-2,6-dimethyl-phenyl)-propionyl]-7-methoxy-6-phenyl-1,2,3,4-tetrahydro-isoquinoline-3-carboxylic acid | CHEMBL430777
Type:
Small organic molecule
Emp. Form.:
C28H30N2O5
Mol. Mass.:
474.5482
SMILES:
COc1cc2CN([C@@H](Cc2cc1-c1ccccc1)C(O)=O)C(=O)C(N)Cc1c(C)cc(O)cc1C
: