Target
Peroxisome proliferator-activated receptor alpha
Ligand
BDBM50085043
Substrate
Meas. Tech.
ChEMBL_139142 (CHEMBL743989)
EC50
930.0±n/a nM
Citation
 Willson, TMBrown, PJSternbach, DDHenke, BR The PPARs: from orphan receptors to drug discovery. J Med Chem 43:527-50 (2000)  
Target
Name:
Peroxisome proliferator-activated receptor alpha
Synonyms:
Nr1c1 PPAR-alpha Peroxisome Proliferator-Activated Receptor alpha Ppara
Type:
PROTEIN
Mol. Mass.:
52343.28
Organism:
Mus musculus
Description:
ChEMBL_572395
Residue:
468
  
Inhibitor
Name:
BDBM50085043
Synonyms:
3-{4-[2-(Benzooxazol-2-yl-methyl-amino)-ethoxy]-phenyl}-2-ethoxy-propionic acid CHEMBL306229 | SB-213068
Type:
Small organic molecule
Emp. Form.:
C21H24N2O5
Mol. Mass.:
384.4257
SMILES:
CCOC(Cc1ccc(OCCN(C)c2nc3ccccc3o2)cc1)C(O)=O
: