Target
4-aminobutyrate aminotransferase, mitochondrial
Ligand
BDBM50085241
Substrate
Meas. Tech.
ChEMBL_70672 (CHEMBL679310)
Ki
4200000±n/a nM
Citation
 Qiu, JSilverman, RB A new class of conformationally rigid analogues of 4-amino-5-halopentanoic acids, potent inactivators of gamma-aminobutyric acid aminotransferase. J Med Chem 43:706-20 (2000)  
Target
Name:
4-aminobutyrate aminotransferase, mitochondrial
Synonyms:
(S)-3-amino-2-methylpropionate transaminase 2.6.1.22 ABAT GABA transaminase GABA-T GABT_PIG L-AIBAT
Type:
Mol. Mass.:
56633.06
Organism:
Sus scrofa
Description:
Residue:
500
  
Inhibitor
Name:
BDBM50085241
Synonyms:
3-Amino-2,4-dibromo-cyclopentanecarboxylic acid | CHEMBL164086
Type:
Small organic molecule
Emp. Form.:
C6H9Br2NO2
Mol. Mass.:
286.949
SMILES:
N[C@@H]1[C@@H](Br)C[C@@H]([C@H]1Br)C(O)=O
: