Target
Trypsin
Ligand
BDBM50085364
Substrate
Meas. Tech.
ChEBML_213023
IC50
44000±n/a nM
Citation
 Hayashi, YIijima, KKatada, JKiso, Y Structure-activity relationship studies of chloromethyl ketone derivatives for selective human chymase inhibitors. Bioorg Med Chem Lett 10:199-201 (2000)  
Target
Name:
Trypsin
Synonyms:
TRYP_PIG
Type:
PROTEIN
Mol. Mass.:
24411.24
Organism:
Sus scrofa
Description:
ChEMBL_1450738
Residue:
231
  
Inhibitor
Name:
BDBM50085364
Synonyms:
CHEMBL59660 | N-((S)-1-Benzyl-3-chloro-2-oxo-propyl)-3-(3-chloro-phenyl)-propionamide
Type:
Small organic molecule
Emp. Form.:
C19H19Cl2NO2
Mol. Mass.:
364.266
SMILES:
ClCC(=O)[C@H](Cc1ccccc1)NC(=O)CCc1cccc(Cl)c1
: