Target
Coagulation factor X
Ligand
BDBM50085402
Substrate
Meas. Tech.
ChEBML_48998
Ki
0.750000±n/a nM
Citation
 Gong, YPauls, HWSpada, APCzekaj, MLiang, GChu, VColussi, DJBrown, KDGao, J Amido-(propyl and allyl)-hydroxybenzamidines: development of achiral inhibitors of factor Xa. Bioorg Med Chem Lett 10:217-21 (2000)  
Target
Name:
Coagulation factor X
Synonyms:
Activated coagulation factor X (FXa) Coagulation factor X precursor F10 Factor X heavy chain Factor Xa Stuart-Prower factor
Type:
Enzyme
Mol. Mass.:
54726.60
Organism:
Homo sapiens (Human)
Description:
Residue:
488
  
Inhibitor
Name:
BDBM50085402
Synonyms:
4-{4-[3-(5-Carbamimidoyl-2-hydroxy-phenyl)-allylcarbamoyl]-phenyl}-pyridine-2-carboxylic acid amide | CHEMBL67692
Type:
Small organic molecule
Emp. Form.:
C23H21N5O3
Mol. Mass.:
415.4445
SMILES:
NC(=N)c1ccc(O)c(\C=C\CNC(=O)c2ccc(cc2)-c2ccnc(c2)C(N)=O)c1
: