Target
Potassium voltage-gated channel subfamily H member 2
Ligand
BDBM50530252
Substrate
Meas. Tech.
ChEMBL_1911678 (CHEMBL4414124)
IC50
7.0±n/a nM
Citation
 Bagdanoff, JTChen, ZAcker, MChen, YNChan, HDore, MFirestone, BFodor, MFortanet, JHentemann, MKato, MKoenig, RLaBonte, LRLiu, SMohseni, MNtaganda, RSarver, PSmith, TSendzik, MStams, TSpence, STowler, CWang, HWang, PWilliams, SLLaMarche, MJ Optimization of Fused Bicyclic Allosteric SHP2 Inhibitors. J Med Chem 62:1781-1792 (2019)  
Target
Name:
Potassium voltage-gated channel subfamily H member 2
Synonyms:
1,3-beta-glucan synthase component GLS2 ERG Eag-related protein 1 Ether-a-go-go-related gene (HERG) Ether-a-go-go-related gene potassium channel 1 Ether-a-go-go-related gene potassium channel 1 (hERG1) Ether-a-go-go-related protein 1 H-ERG KCNH2 Potassium voltage-gated channel subfamily H member 2 (hERG) Voltage-gated potassium channel subunit Kv11.1 hERG Potassium Channel 1 | putative potassium channel subunit
Type:
Multi-pass membrane protein
Mol. Mass.:
126672.65
Organism:
Homo sapiens (Human)
Description:
Q12809
Residue:
1159
  
Inhibitor
Name:
BDBM50530252
Synonyms:
CHEMBL4475081
Type:
Small organic molecule
Emp. Form.:
C21H23Cl2N5O
Mol. Mass.:
432.346
SMILES:
C[C@@H]1OCC2(CCN(CC2)c2cnc3c(c[nH]c3n2)-c2cccc(Cl)c2Cl)[C@@H]1N
: