Target
Cytosolic phospholipase A2
Ligand
BDBM50085499
Substrate
Meas. Tech.
ChEBML_156221
IC50
62800±n/a nM
Citation
 Lucas, RUbeda, APayá, MAlves, Mdel Olmo, ELópez, JLSan Feliciano, A Synthesis and enzyme inhibitory activities of a series of lipidic diamine and aminoalcohol derivatives on cytosolic and secretory phospholipases A2. Bioorg Med Chem Lett 10:285-8 (2000)  
Target
Name:
Cytosolic phospholipase A2
Synonyms:
Cpla2 Pla2g4 | Pla2g4a
Type:
PROTEIN
Mol. Mass.:
85206.20
Organism:
Mus musculus
Description:
ChEMBL_156221
Residue:
748
  
Inhibitor
Name:
BDBM50085499
Synonyms:
4-(1-(benzyloxy)hexadecan-2-ylamino)-4-oxobutanoic acid N-(1-Benzyloxymethyl-pentadecyl)-succinamic acid
Type:
Small organic molecule
Emp. Form.:
C27H45NO4
Mol. Mass.:
447.6505
SMILES:
CCCCCCCCCCCCCCC(COCc1ccccc1)NC(=O)CCC(O)=O
: