Target
Non-receptor tyrosine-protein kinase TYK2
Ligand
BDBM50530403
Substrate
Meas. Tech.
ChEMBL_1912202 (CHEMBL4414785)
IC50
0.580000±n/a nM
Target
Name:
Non-receptor tyrosine-protein kinase TYK2
Synonyms:
Non-receptor tyrosine-protein kinase TYK2 (TYK2) TYK2_HUMAN | Tyrosine-protein kinase TYK2
Type:
Protein
Mol. Mass.:
133666.03
Organism:
Homo sapiens (Human)
Description:
P29597
Residue:
1187
  
Inhibitor
Name:
BDBM50530403
Synonyms:
CHEMBL4583185
Type:
Small organic molecule
Emp. Form.:
C18H17FN6O3S
Mol. Mass.:
419.448
SMILES:
[2H]C([2H])([2H])NC(=O)c1nnc(Nc2ccc(F)cn2)cc1Nc1ccccc1S(C)(=O)=O
: