Target
2-5A-dependent ribonuclease
Ligand
BDBM50085559
Substrate
Meas. Tech.
ChEMBL_195094 (CHEMBL795061)
EC50
4±n/a nM
Citation
 Kitade, YWakana, MTsuboi, TYatome, CBayly, SFPlayer, MRTorrence, PF 2-Methyladenosine-Substituted 2',5'-oligoadenylates: conformations, 2-5A binding and catalytic activities with human ribonuclease L. Bioorg Med Chem Lett 10:329-31 (2000)  
Target
Name:
2-5A-dependent ribonuclease
Synonyms:
2-5A-dependent RNase RN5A_HUMAN RNS4 Ribonuclease 4 | Ribonuclease L
Type:
PROTEIN
Mol. Mass.:
83534.35
Organism:
Homo sapiens (Human)
Description:
ChEMBL_164152
Residue:
741
  
Inhibitor
Name:
BDBM50085559
Synonyms:
CHEMBL410213 | Oligoadenylate analogue
Type:
Small organic molecule
Emp. Form.:
C33H46N15O25P5
Mol. Mass.:
1207.6727
SMILES:
Cc1nc(N)c2ncn([C@@H]3O[C@H](COP(O)(=O)O[C@@H]4[C@H](O)[C@@H](COP(O)(=O)O[C@@H]5[C@H](O)[C@@H](COP(O)(=O)OP(O)(=O)OP(O)(O)=O)O[C@H]5n5cnc6c(N)nc(C)nc56)O[C@H]4n4cnc5c(N)nc(C)nc45)[C@@H](O)[C@H]3O)c2n1
: