Target
Platelet-activating factor acetylhydrolase
Ligand
BDBM50085622
Substrate
Meas. Tech.
ChEBML_156217
IC50
250±n/a nM
Citation
 Boyd, HFFlynn, STHickey, DMIfe, RJJones, MLeach, CAMacphee, CHMilliner, KJRawlings, DASlingsby, BPSmith, SAStansfield, IGTew, DGTheobald, CJ 2-(Alkylthio)pyrimidin-4-ones as novel, reversible inhibitors of lipoprotein-associated phospholipase A2. Bioorg Med Chem Lett 10:395-8 (2000)  
Target
Name:
Platelet-activating factor acetylhydrolase
Synonyms:
1-alkyl-2-acetylglycerophosphocholine esterase LDL-PLA(2) PAF 2-acylhydrolase PAFAH PLA2G7 | Platelet-activating factor acetylhydrolase
Type:
PROTEIN
Mol. Mass.:
50084.41
Organism:
Homo sapiens (Human)
Description:
ChEMBL_156212
Residue:
441
  
Inhibitor
Name:
BDBM50085622
Synonyms:
5-(1-Methyl-2-oxo-1,2-dihydro-pyridin-4-ylmethyl)-2-(8-phenyl-octylsulfanyl)-1H-pyrimidin-4-one | CHEMBL340482
Type:
Small organic molecule
Emp. Form.:
C25H31N3O2S
Mol. Mass.:
437.598
SMILES:
Cn1ccc(Cc2cnc(SCCCCCCCCc3ccccc3)[nH]c2=O)cc1=O
: